BDBM84464 Benzylation of mannostatin A, 1d
SMILES CS[C@H]1[C@H](O)[C@H](O)[C@H](O)[C@@H]1NCc1ccc(Cl)cc1
InChI Key InChIKey=KQEFCFOFAIYMGT-ZOLYEBIHSA-N
Data  2 KI
  Tab Delimited (TSV)   2D SDfile   Computed 3D by Vconf -m prep SDfile
Find this compound or compounds like it in BindingDB:
Activity Spreadsheet -- Enzyme Inhibition Constant Data from BindingDB
Found 2 hits for monomerid = 84464
TargetAlpha-mannosidase 2(Homo sapiens (Human))
University Of Georgia
LigandPNGBDBM84464(Benzylation of mannostatin A, 1d)
Affinity DataKi:  100nM ΔG°:  -9.93kcal/molepH: 5.6 T: 2°C
In DepthDetails ArticlePubMed
TargetAlpha-mannosidase 2(Homo sapiens (Human))
University Of Georgia
LigandPNGBDBM84464(Benzylation of mannostatin A, 1d)
Affinity DataKi:  910nM ΔG°:  -8.57kcal/molepH: 5.6 T: 2°C
In DepthDetails ArticlePubMed