BDBM84470 Aminocyclopentitetrol, 2c
SMILES O[C@H]1[C@@H](O)[C@@H](O)[C@@H](NCc2ccc(F)cc2)[C@H]1O
InChI Key InChIKey=ZOJYEVHMPGSACR-NMZKHRHQSA-N
Data  2 KI
  Tab Delimited (TSV)   2D SDfile   Computed 3D by Vconf -m prep SDfile
Find this compound or compounds like it in BindingDB:
Activity Spreadsheet -- Enzyme Inhibition Constant Data from BindingDB
Found 2 hits for monomerid = 84470
TargetAlpha-mannosidase 2(Homo sapiens (Human))
University Of Georgia
LigandPNGBDBM84470(Aminocyclopentitetrol, 2c)
Affinity DataKi:  330nM ΔG°:  -9.19kcal/molepH: 5.6 T: 2°C
In DepthDetails ArticlePubMed
TargetAlpha-mannosidase 2(Homo sapiens (Human))
University Of Georgia
LigandPNGBDBM84470(Aminocyclopentitetrol, 2c)
Affinity DataKi:  6.00E+3nM ΔG°:  -7.41kcal/molepH: 5.6 T: 2°C
In DepthDetails ArticlePubMed