BDBM8496 (2R)-2-[(4-fluoro-3-methylbenzene)sulfonamido]-N-hydroxyhexanamide::hydroxamate analogue 33
SMILES CCCC[C@@H](NS(=O)(=O)c1ccc(F)c(C)c1)C(=O)NO
InChI Key InChIKey=OUZHNKSAQNAXTF-GFCCVEGCSA-N
Data  1 IC50
  Tab Delimited (TSV)   2D SDfile   Computed 3D by Vconf -m prep SDfile
Find this compound or compounds like it in BindingDB:
Activity Spreadsheet -- Enzyme Inhibition Constant Data from BindingDB
Found 1 hit for monomerid = 8496
TargetLethal factor(Bacillus anthracis)
Merck Research Laboratories
LigandPNGBDBM8496((2R)-2-[(4-fluoro-3-methylbenzene)sulfonamido]-N-h...)
Affinity DataIC50:  70nM. Assay description: The assay was performed in a 96-well plate, each well contained substrate peptide, LF, and the test compound. The C-terminally fluorophore of substra...
In DepthDetails ArticlePubMed