BDBM85029 Cetirizine (+) isomer
SMILES OC(=O)COCCN1CCN(CC1)[C@@H](c1ccccc1)c1ccc(Cl)cc1
InChI Key InChIKey=ZKLPARSLTMPFCP-NRFANRHFSA-N
Data  2 KI
PDB links: 1 PDB ID matches this monomer.
  Tab Delimited (TSV)   2D SDfile   Computed 3D by Vconf -m prep SDfile
Find this compound or compounds like it in BindingDB:
Activity Spreadsheet -- Enzyme Inhibition Constant Data from BindingDB
Found 2 hits for monomerid = 85029
TargetHistamine H1 receptor(Homo sapiens (Human))
Universite Libre De Bruxelles
Curated by PDSP Ki Database
LigandPNGBDBM85029(Cetirizine (+) isomer)
Affinity DataKi:  3.16nM
In DepthDetails ArticlePubMed
TargetHistamine H1 receptor(Homo sapiens (Human))
Universite Libre De Bruxelles
Curated by PDSP Ki Database
LigandPNGBDBM85029(Cetirizine (+) isomer)
Affinity DataKi:  79.4nM
In DepthDetails ArticlePubMed