BDBM85047 SDZ GLC 756
SMILES CN1C[C@H](CSc2ccccn2)C[C@@H]2Cc3c(O)cccc3C[C@@H]12
InChI Key InChIKey=OZUQRMYHPWAQQC-QGPMSJSTSA-N
Data  2 KI
  Tab Delimited (TSV)   2D SDfile   Computed 3D by Vconf -m prep SDfile
Find this compound or compounds like it in BindingDB:
Activity Spreadsheet -- Enzyme Inhibition Constant Data from BindingDB
Found 2 hits for monomerid = 85047
TargetD(2) dopamine receptor(Rattus norvegicus (rat))
University Of Toronto
Curated by PDSP Ki Database
LigandPNGBDBM85047(SDZ GLC 756)
In DepthDetails ArticlePubMed
TargetD(2) dopamine receptor(Homo sapiens (Human))
University Of Toronto
Curated by PDSP Ki Database
LigandPNGBDBM85047(SDZ GLC 756)
Affinity DataKi:  75nM
In DepthDetails ArticlePubMed