BDBM85792 PYY, N-alpha-Ac, 25-36
SMILES CCC(C)C[C@H](NC(=O)[C@H](CC(N)=O)NC(=O)[C@@H](NC(=O)[C@H](Cc1ccc(O)cc1)NC(=O)[C@H](Cc1cnc[nH]1)NC(C)=O)[C@@H](C)CC)C(=O)N[C@@H](C(C)C)C(=O)N[C@@H]([C@@H](C)O)C(=O)N[C@@H](CCCN=C(N)N)C(=O)N[C@@H](CCC(N)=O)C(=O)N[C@@H](CCCN=C(N)N)C(=O)N[C@@H](Cc1ccc(O)cc1)C(N)=O
InChI Key InChIKey=BYIOTIVSCFPVQE-GGEMCTJUSA-N
Data  2 KI
  Tab Delimited (TSV)   2D SDfile   Computed 3D by Vconf -m prep SDfile
Find this compound or compounds like it in BindingDB:
Activity Spreadsheet -- Enzyme Inhibition Constant Data from BindingDB
Found 2 hits for monomerid = 85792
LigandPNGBDBM85792(PYY, N-alpha-Ac, 25-36)
Affinity DataKi:  0.210nM
In DepthDetails ArticlePubMed
LigandPNGBDBM85792(PYY, N-alpha-Ac, 25-36)
Affinity DataKi:  0.770nM
In DepthDetails ArticlePubMed