BDBM85834 [Pro14]h alpha-CGRP
SMILES [#6]-[#6](-[#6])-[#6]-[#6](-[#7]-[#6](=O)-[#6](-[#6]-[#6]-[#6]\[#7]=[#6](\[#7])-[#7])-[#7]-[#6](=O)-[#6](-[#6]-[#6]-1-[#6]-[#7]-[#6]-[#7]-1)-[#7]-[#6](=O)-[#6](-[#7]-[#6](=O)-[#6](-[#7]-[#6](=O)-[#6](-[#6]-[#16])-[#7]-[#6](=O)-[#6](-[#7]-[#6](=O)-[#6](-[#6])-[#7]-[#6](=O)-[#6](-[#7]-[#6](=O)-[#6](-[#6]-[#6](-[#8])=O)-[#7]-[#6](=O)-[#6](-[#6]-[#16])-[#7]-[#6](=O)-[#6](-[#6])-[#7])-[#6](-[#6])-[#8])-[#6](-[#6])-[#8])-[#6](-[#6])-[#6])-[#6](-[#6])-[#8])-[#6](=O)-[#7]-[#6](-[#6])-[#6](=O)-[#7]-1-[#6]-[#6]-[#6]-[#6]-1-[#6](=O)-[#7]-[#6](-[#6]-[#6](-[#6])-[#6])-[#6](=O)-[#7]-[#6](-[#6]-[#6](-[#6])-[#6])-[#6](=O)-[#7]-[#6](-[#6]-[#8])-[#6](=O)-[#7]-[#6](-[#6]-[#6]-[#6]\[#7]=[#6](\[#7])-[#7])-[#6](=O)-[#7]-[#6](-[#6]-[#8])-[#6](=O)-[#7]-[#6]-[#6](=O)-[#7]-[#6]-[#6](=O)-[#7]-[#6](-[#6](-[#6])-[#6])-[#6](=O)-[#7]-[#6](-[#6](-[#6])-[#6])-[#6](=O)-[#7]-[#6](-[#6]-[#6]-[#6]-[#6]-[#7])-[#6](=O)-[#7]-[#6](-[#6]-[#6](-[#7])=O)-[#6](=O)-[#7]-[#6](-[#6]-[#6](-[#7])=O)-[#6](=O)-[#7]-[#6](-[#6]-c1ccccc1)-[#6](=O)-[#7]-[#6](-[#6](-[#6])-[#6])-[#6](=O)-[#7]-1-[#6]-[#6]-[#6]-[#6]-1-[#6](=O)-[#7]-[#6](-[#6](-[#6])-[#8])-[#6](=O)-[#7]-[#6](-[#6]-[#6](-[#7])=O)-[#6](=O)-[#7]-[#6](-[#6](-[#6])-[#6])-[#6](=O)-[#7]-[#6]-[#6](=O)-[#7]-[#6](-[#6]-[#8])-[#6](=O)-[#7]-[#6](-[#6]-[#6]-[#6]-[#6]-[#7])-[#6](=O)-[#7]-[#6](-[#6])-[#6](=O)-[#7]-[#6](-[#6]-c1ccccc1)-[#6](-[#7])=O
InChI Key InChIKey=YMHBOHLYBXLIQS-UHFFFAOYSA-N
Data  2 KI
  Tab Delimited (TSV)   2D SDfile   Computed 3D by Vconf -m prep SDfile
Find this compound or compounds like it in BindingDB:
Activity Spreadsheet -- Enzyme Inhibition Constant Data from BindingDB
Found 2 hits for monomerid = 85834
TargetReceptor activity-modifying protein 1(PIG)
Creighton University
Curated by PDSP Ki Database
LigandPNGBDBM85834([Pro14]h alpha-CGRP)
Affinity DataKi:  5.5nM
In DepthDetails PubMed
TargetCalcitonin gene-related peptide type 1 receptor(PIG)
Creighton University
Curated by PDSP Ki Database
LigandPNGBDBM85834([Pro14]h alpha-CGRP)
In DepthDetails PubMed