BDBM85953 D-Arg6,Ava9,10
SMILES [#6]-[#16]-[#6]-[#6]-[#6]-1-[#7]-[#6](=O)-[#6@@H](-[#6]-[#16]-[#16]-[#6]-[#6](-[#7]-[#6](=O)-[#6]-2-[#6]-[#6]-[#6]-[#7]-2-[#6](=O)-[#6](-[#6]-[#6]-[#6]\[#7]=[#6](\[#7])-[#7])-[#7]-[#6](=O)-[#6](-[#6]-c2ccc(-[#8])cc2)-[#7]-[#6](=O)-[#6](-[#7]-[#6](=O)-[#6](-[#6]-[#6]-[#6]\[#7]=[#6](\[#7])-[#7])-[#7]-[#6](=O)-[#6]-[#6]-[#6]-[#6]-[#7]-[#6]-1=O)-[#6](-[#6])-[#6])-[#6](-[#7])=O)-[#7]-[#6](=O)-[#6](-[#6]-[#6]-[#6]\[#7]=[#6](\[#7])-[#7])-[#7]-[#6](-[#6])=O
InChI Key InChIKey=KWXXYUJNTJJXLU-OSCYVCFSSA-N
Data  2 KI
  Tab Delimited (TSV)   2D SDfile   Computed 3D by Vconf -m prep SDfile
Find this compound or compounds like it in BindingDB:
Activity Spreadsheet -- Enzyme Inhibition Constant Data from BindingDB
Found 2 hits for monomerid = 85953
TargetMelanin-concentrating hormone receptor 1(Homo sapiens (Human))
Merck Research Laboratories
Curated by PDSP Ki Database
LigandPNGBDBM85953(D-Arg6,Ava9,10)
Affinity DataKi:  6.80nM
In DepthDetails ArticlePubMed
TargetMelanin-concentrating hormone receptor 2(Homo sapiens (Human))
Merck Research Laboratories
Curated by PDSP Ki Database
LigandPNGBDBM85953(D-Arg6,Ava9,10)
Affinity DataKi:  23nM
In DepthDetails ArticlePubMed