BDBM89422 5-(diethylsulfamoyl)-N-[2-(2,6-difluoroanilino)-2-keto-ethyl]-N-ethyl-2-piperidino-benzamide::5-(diethylsulfamoyl)-N-[2-(2,6-difluoroanilino)-2-oxoethyl]-N-ethyl-2-(1-piperidinyl)benzamide::5-(diethylsulfamoyl)-N-[2-(2,6-difluoroanilino)-2-oxoethyl]-N-ethyl-2-piperidin-1-ylbenzamide::MLS001077544::N-[2-[[2,6-bis(fluoranyl)phenyl]amino]-2-oxidanylidene-ethyl]-5-(diethylsulfamoyl)-N-ethyl-2-piperidin-1-yl-benzamide::SMR000715396::cid_24856284
SMILES CCN(CC(=O)Nc1c(F)cccc1F)C(=O)c1cc(ccc1N1CCCCC1)S(=O)(=O)N(CC)CC
InChI Key InChIKey=RWYMSGLGGJXGIV-UHFFFAOYSA-N
Data  2 IC50
  Tab Delimited (TSV)   2D SDfile   Computed 3D by Vconf -m prep SDfile
Find this compound or compounds like it in BindingDB:
Activity Spreadsheet -- Enzyme Inhibition Constant Data from BindingDB
Found 2 hits for monomerid = 89422
TargetProtein Wnt-3a(Mus musculus)
Burnham Center For Chemical Genomics
Curated by PubChem BioAssay
LigandPNGBDBM89422(5-(diethylsulfamoyl)-N-[2-(2,6-difluoroanilino)-2-...)
Affinity DataIC50:  1.14E+4nM
In DepthDetails PCBioAssay
TargetZinc finger protein GLI1(Mus musculus)
Burnham Center For Chemical Genomics
Curated by PubChem BioAssay
LigandPNGBDBM89422(5-(diethylsulfamoyl)-N-[2-(2,6-difluoroanilino)-2-...)
Affinity DataIC50:  1.22E+4nM. Assay description: Data Source: Sanford-Burnham Center for Chemical Genomics (SBCCG) Source Affiliation: Sanford-Burnham Medical Research Institute (SBMRI, San Diego, C...
In DepthDetails PCBioAssay