BDBM89964 2-chloranyl-N-[2-(4-ethyl-5-sulfanylidene-1H-1,2,4-triazol-3-yl)ethyl]benzamide::2-chloro-N-[2-(4-ethyl-5-sulfanyl-4H-1,2,4-triazol-3-yl)ethyl]benzamide::2-chloro-N-[2-(4-ethyl-5-sulfanylidene-1H-1,2,4-triazol-3-yl)ethyl]benzamide::2-chloro-N-[2-(4-ethyl-5-thioxo-1H-1,2,4-triazol-3-yl)ethyl]benzamide::MLS000324770::SMR000161783::cid_7315478
SMILES CCn1c(CCNC(=O)c2ccccc2Cl)n[nH]c1=S
InChI Key InChIKey=CMGJNJASNFIWIF-UHFFFAOYSA-N
Data  1 EC50
  Tab Delimited (TSV)   2D SDfile   Computed 3D by Vconf -m prep SDfile
Find this compound or compounds like it in BindingDB:
Activity Spreadsheet -- Enzyme Inhibition Constant Data from BindingDB
Found 1 hit for monomerid = 89964
TargetCorticotropin-releasing factor-binding protein(Homo sapiens (Human))
Burnham Center For Chemical Genomics
Curated by PubChem BioAssay
LigandPNGBDBM89964(2-chloranyl-N-[2-(4-ethyl-5-sulfanylidene-1H-1,2,4...)
Affinity DataEC50: >5.30E+4nM. Assay description: Data Source: Sanford-Burnham Center for Chemical Genomics (SBCCG) Source Affiliation: Sanford-Burnham Medical Research Institute (SBMRI, San Diego, C...
Ligand InfoPC cidPC sid
In DepthDetails PCBioAssay