BDBM90104 (E,4Z)-2-cyano-4-(3-ethyl-1,3-benzothiazol-2-ylidene)-3-methyl-2-butenoic acid ethyl ester::(E,4Z)-2-cyano-4-(3-ethyl-1,3-benzothiazol-2-ylidene)-3-methyl-but-2-enoic acid ethyl ester::2-Cyano-4-(3-ethyl-3H-benzothiazol-2-ylidene)-3-methyl-but-2-enoic acid ethyl ester::MLS000560378::SMR000174364::cid_5405328::ethyl (E,4Z)-2-cyano-4-(3-ethyl-1,3-benzothiazol-2-ylidene)-3-methyl-but-2-enoate::ethyl (E,4Z)-2-cyano-4-(3-ethyl-1,3-benzothiazol-2-ylidene)-3-methylbut-2-enoate
SMILES CCOC(=O)C(\C#N)=C(/C)\C=C1/Sc2ccccc2N1CC
InChI Key InChIKey=XLNPTJJCJANNSD-JJUTUZPASA-N
Data  1 EC50
  Tab Delimited (TSV)   2D SDfile   Computed 3D by Vconf -m prep SDfile
Find this compound or compounds like it in BindingDB:
Activity Spreadsheet -- Enzyme Inhibition Constant Data from BindingDB
Found 1 hit for monomerid = 90104
TargetCorticotropin-releasing factor-binding protein(Homo sapiens (Human))
Burnham Center For Chemical Genomics
Curated by PubChem BioAssay
LigandPNGBDBM90104((E,4Z)-2-cyano-4-(3-ethyl-1,3-benzothiazol-2-ylide...)
Affinity DataEC50:  1.84E+4nM. Assay description: Data Source: Sanford-Burnham Center for Chemical Genomics (SBCCG) Source Affiliation: Sanford-Burnham Medical Research Institute (SBMRI, San Diego, C...
In DepthDetails PCBioAssay