BDBM91269 MLS002320510::PbTx-2 dioxolane::SMR001338800::cid_42628601
SMILES CC(CC1CC(O)[C@]2(C)OC3CC4OC5C[C@]6(C)O[C@]7(C)CCC8OC9C[C@]%10(C)OC%11C(CC%10OC9C[C@@H](C)C8OC7CC6O[C@]5(C)C\C=C/C4OC3CC2O1)OC(=O)C=C%11C)C1OCCO1
InChI Key InChIKey=PXMJJBXNBVRFRL-IWYHKUIOSA-N
Data  1 EC50
  Tab Delimited (TSV)   2D SDfile   Computed 3D by Vconf -m prep SDfile
Find this compound or compounds like it in BindingDB:
Activity Spreadsheet -- Enzyme Inhibition Constant Data from BindingDB
Found 1 hit for monomerid = 91269
TargetCorticotropin-releasing factor-binding protein(Homo sapiens (Human))
Burnham Center For Chemical Genomics
Curated by PubChem BioAssay
LigandPNGBDBM91269(MLS002320510 | PbTx-2 dioxolane | SMR001338800 | c...)
Affinity DataEC50:  5.68E+3nM. Assay description: Data Source: Sanford-Burnham Center for Chemical Genomics (SBCCG) Source Affiliation: Sanford-Burnham Medical Research Institute (SBMRI, San Diego, C...
In DepthDetails PCBioAssay