BDBM91550 1,3-diphenyl-5-(p-tolyl)-2-pyrazoline::3-(4-methylphenyl)-2,5-diphenyl-3,4-dihydropyrazole::VU0466988-1::cid_2729183
SMILES Cc1ccc(cc1)C1CC(=NN1c1ccccc1)c1ccccc1
InChI Key InChIKey=ZDTNKHNZNGPMJY-UHFFFAOYSA-N
Data  2 KI  3 EC50
  Tab Delimited (TSV)   2D SDfile   Computed 3D by Vconf -m prep SDfile
Find this compound or compounds like it in BindingDB:
Activity Spreadsheet -- Enzyme Inhibition Constant Data from BindingDB
Found 5 hits for monomerid = 91550
TargetCathepsin B(Capra hircus (Goat))
Kurukshetra University
Curated by ChEMBL
LigandPNGBDBM91550(1,3-diphenyl-5-(p-tolyl)-2-pyrazoline | 3-(4-methy...)
Affinity DataKi:  1.37E+3nM. Assay description: Competitive inhibition of goat liver cathepsin B using BANA substrate by Lineweaver-Burk plot analysis
In DepthDetails ArticlePubMed
TargetCathepsin H(Capra hircus (Goat))
Kurukshetra University
Curated by ChEMBL
LigandPNGBDBM91550(1,3-diphenyl-5-(p-tolyl)-2-pyrazoline | 3-(4-methy...)
Affinity DataKi:  4.18E+3nM. Assay description: Competitive inhibition of goat liver cathepsin H using Leu-betaNA substrate by Lineweaver-Burk plot analysis
In DepthDetails ArticlePubMed
TargetLethal factor(Bacillus anthracis)
Nmmlsc
Curated by PubChem BioAssay
LigandPNGBDBM91550(1,3-diphenyl-5-(p-tolyl)-2-pyrazoline | 3-(4-methy...)
Affinity DataEC50: >2.00E+4nM. Assay description: University of New Mexico Assay Overview: Assay Support: 1 R03 MH093184-01A1 Project Title: High-throughput multiplex microsphere screening for tox...
In DepthDetails PCBioAssay
TargetBotulinum neurotoxin type A(Clostridium botulinum (strain Hall / ATCC 3502 / N...)
Nmmlsc
Curated by PubChem BioAssay
LigandPNGBDBM91550(1,3-diphenyl-5-(p-tolyl)-2-pyrazoline | 3-(4-methy...)
Affinity DataEC50: >2.00E+4nM. Assay description: University of New Mexico Assay Overview: Assay Support: 1 R03 MH093184-01A1 Project Title: High-throughput multiplex microsphere screening for tox...
In DepthDetails PCBioAssay
TargetBotulinum neurotoxin type F(Clostridium botulinum Bf)
Nmmlsc
Curated by PubChem BioAssay
LigandPNGBDBM91550(1,3-diphenyl-5-(p-tolyl)-2-pyrazoline | 3-(4-methy...)
Affinity DataEC50: >2.00E+4nM. Assay description: University of New Mexico Assay Overview: Assay Support: 1 R03 MH093184-01A1 Project Title: High-throughput multiplex microsphere screening for tox...
In DepthDetails PCBioAssay