BDBM91758 CS184
SMILES COc1ccccc1CNC(=O)CSc1nnnn1-c1c(C)cccc1C
InChI Key InChIKey=XKCUIOJOSCXLRF-UHFFFAOYSA-N
Data  4 Kd
  Tab Delimited (TSV)   2D SDfile   Computed 3D by Vconf -m prep SDfile
Find this compound or compounds like it in BindingDB:
Activity Spreadsheet -- Enzyme Inhibition Constant Data from BindingDB
Found 4 hits for monomerid = 91758
TargetCyclin-dependent kinase 2(Homo sapiens (Human))
Csar
LigandPNGBDBM91758(CS184)
Affinity DataKd: >1.00E+5nMpH: 7.5 T: 2°C. Assay description: OctetRed
Ligand InfoPC cidPC sid
In DepthDetails PubMed
TargetCyclin-dependent kinase 2(Homo sapiens (Human))
Csar
LigandPNGBDBM91758(CS184)
Affinity DataKd: >1.00E+5nM. Assay description: OctetRed_Method1
Ligand InfoPC cidPC sid
In DepthDetails PubMed
TargetCyclin-dependent kinase 2(Homo sapiens (Human))
Csar
LigandPNGBDBM91758(CS184)
Affinity DataKd: >1.00E+5nM. Assay description: OctetRed_Method1
Ligand InfoPC cidPC sid
In DepthDetails PubMed
TargetCyclin-A2/Cyclin-dependent kinase 2(Homo sapiens (Human))
Csar
LigandPNGBDBM91758(CS184)
Affinity DataKd: >1.00E+5nMpH: 7.5 T: 2°C. Assay description: OctetRed
Ligand InfoPC cidPC sid
In DepthDetails PubMed