BDBM92033 erk000438
SMILES Cc1cnc(Nc2cccc(c2)C(F)(F)F)nc1-c1c[nH]c(c1)C(=O)N[C@H](CO)c1ccccc1
InChI Key InChIKey=PZZFOGDFDXVCEC-OAQYLSRUSA-N
Data  2 KI
  Tab Delimited (TSV)   2D SDfile   Computed 3D by Vconf -m prep SDfile
Find this compound or compounds like it in BindingDB:
Activity Spreadsheet -- Enzyme Inhibition Constant Data from BindingDB
Found 2 hits for monomerid = 92033
TargetMitogen-activated protein kinase 1(Homo sapiens (Human))
D3R/Abbott
LigandPNGBDBM92033(erk000438)
Affinity DataKi:  2nM. Assay description: Photometric_Method2
In DepthDetails PubMed
TargetMitogen-activated protein kinase 1(Homo sapiens (Human))
D3R/Abbott
LigandPNGBDBM92033(erk000438)
Affinity DataKi:  2nM. Assay description: Assay 1 ...
In DepthDetails PubMed