BDBM93091 Analogue of 1a, 8k
SMILES CN(c1c(N)n(Cc2ccccc2)c(=O)[nH]c1=O)S(=O)(=O)c1ccc(F)cc1
InChI Key InChIKey=NBJLHGBRFRTIKT-UHFFFAOYSA-N
Data  1 IC50
PDB links: 1 PDB ID matches this monomer.
  Tab Delimited (TSV)   2D SDfile   Computed 3D by Vconf -m prep SDfile
Find this compound or compounds like it in BindingDB:
Activity Spreadsheet -- Enzyme Inhibition Constant Data from BindingDB
Found 1 hit for monomerid = 93091
TargetGlucose-1-phosphate thymidylyltransferase(Pseudomonas aeruginosa)
University Of St. Andrews
LigandPNGBDBM93091(Analogue of 1a, 8k)
Affinity DataIC50:  205nM. Assay description: Inhibition assay using glucose-1-phosphate thymidylyltransferase (RmlA).