BDBM93361 PSTQ Analog, 3{1,12}
SMILES O=S(=O)(c1nnn2c1nc(NCc1ccccc1)c1ccccc21)c1ccccc1
InChI Key InChIKey=NRZSBSXASODLTG-UHFFFAOYSA-N
Data  1 IC50
  Tab Delimited (TSV)   2D SDfile   Computed 3D by Vconf -m prep SDfile
Find this compound or compounds like it in BindingDB:
Activity Spreadsheet -- Enzyme Inhibition Constant Data from BindingDB
Found 1 hit for monomerid = 93361
Target5-hydroxytryptamine receptor 6(Homo sapiens (Human))
Chemical Diversity Research Institute
LigandPNGBDBM93361(PSTQ Analog, 3{1,12})
Affinity DataIC50:  381nM. Assay description: Radioligand binding assay using 5-HT6R.
In DepthDetails ArticlePubMed