BDBM93384 PSTQ Analog, 3{10,33}
SMILES COc1cccc(Nc2nc3c(nnn3c3ccccc23)S(=O)(=O)c2c(C)cc(C)cc2C)c1
InChI Key InChIKey=AQSJPYSNAGNGBB-UHFFFAOYSA-N
Data  1 IC50
  Tab Delimited (TSV)   2D SDfile   Computed 3D by Vconf -m prep SDfile
Find this compound or compounds like it in BindingDB:
Activity Spreadsheet -- Enzyme Inhibition Constant Data from BindingDB
Found 1 hit for monomerid = 93384
Target5-hydroxytryptamine receptor 6(Homo sapiens (Human))
Chemical Diversity Research Institute
LigandPNGBDBM93384(PSTQ Analog, 3{10,33})
Affinity DataIC50:  670nM. Assay description: Radioligand binding assay using 5-HT6R.
In DepthDetails ArticlePubMed