BDBM93390 PSTQ Analog, 3{1,2}
SMILES CNc1nc2c(nnn2c2ccccc12)S(=O)(=O)c1ccccc1
InChI Key InChIKey=AOMLPOXHZHVZSB-UHFFFAOYSA-N
Data  1 IC50
  Tab Delimited (TSV)   2D SDfile   Computed 3D by Vconf -m prep SDfile
Find this compound or compounds like it in BindingDB:
Activity Spreadsheet -- Enzyme Inhibition Constant Data from BindingDB
Found 1 hit for monomerid = 93390
Target5-hydroxytryptamine receptor 6(Homo sapiens (Human))
Chemical Diversity Research Institute
LigandPNGBDBM93390(PSTQ Analog, 3{1,2})
Affinity DataIC50: >300nM. Assay description: Radioligand binding assay using 5-HT6R.
In DepthDetails ArticlePubMed