BDBM93399 PSTQ Analog, 3{1,49}
SMILES CC1CCCCN1c1nc2c(nnn2c2ccccc12)S(=O)(=O)c1ccccc1
InChI Key InChIKey=RCJLCFZGAYGMDC-UHFFFAOYSA-N
Data  1 KI  1 IC50
  Tab Delimited (TSV)   2D SDfile   Computed 3D by Vconf -m prep SDfile
Find this compound or compounds like it in BindingDB:
Activity Spreadsheet -- Enzyme Inhibition Constant Data from BindingDB
Found 1 hit for monomerid = 93399
Target5-hydroxytryptamine receptor 6(Homo sapiens (Human))
Chemical Diversity Research Institute
LigandPNGBDBM93399(PSTQ Analog, 3{1,49})
Affinity DataKi:  19.5nM IC50:  42.1nM. Assay description: Radioligand binding assay using 5-HT6R.
In DepthDetails ArticlePubMed