BDBM9422 CHEMBL126457::N-{2-[1-(cyclopropylmethyl)piperidin-4-yl]ethyl}-N-methylbenzamide hydrochloride::Piperidine Derivative 34
SMILES CN(CCC1CCN(CC2CC2)CC1)C(=O)c1ccccc1
InChI Key InChIKey=GFSATERCQIHYAN-UHFFFAOYSA-N
Data  2 IC50
  Tab Delimited (TSV)   2D SDfile   Computed 3D by Vconf -m prep SDfile
Find this compound or compounds like it in BindingDB:
Activity Spreadsheet -- Enzyme Inhibition Constant Data from BindingDB
Found 2 hits for monomerid = 9422
TargetAcetylcholinesterase(Mus musculus (mouse))
University Of Missouri St. Louis
Curated by ChEMBL
LigandPNGBDBM9422(CHEMBL126457 | N-{2-[1-(cyclopropylmethyl)piperidi...)
Affinity DataIC50:  3.80E+4nM. Assay description: Inhibition against Acetylcholinesterase (AChE)
In DepthDetails ArticlePubMed
TargetAcetylcholinesterase(Mus musculus (mouse))
University Of Missouri St. Louis
Curated by ChEMBL
LigandPNGBDBM9422(CHEMBL126457 | N-{2-[1-(cyclopropylmethyl)piperidi...)
Affinity DataIC50:  3.80E+4nM. Assay description: The cholinesterase assays were performed using colorimetric method reported by Ellman. The amount of a yellow substance formed after incubation was d...
In DepthDetails ArticlePubMed