BDBM9437 CHEMBL1084530::Heterodimeric Tacrine-Based Inhibitor 7h::N-4-Pyridyl-N-9-(1,2,3,4-tetrahydroacridinyl)-1,9-diaminononane Bis-hydrochloride::N-[9-(1,2,3,4-tetrahydroacridin-9-ylamino)nonyl]pyridin-4-amine dihydrochloride
SMILES C(CCCCNc1ccncc1)CCCCNc1c2CCCCc2nc2ccccc12
InChI Key InChIKey=SOARTDIDZFKTKX-UHFFFAOYSA-N
Data  3 IC50
  Tab Delimited (TSV)   2D SDfile   Computed 3D by Vconf -m prep SDfile
Find this compound or compounds like it in BindingDB:
Activity Spreadsheet -- Enzyme Inhibition Constant Data from BindingDB
Found 3 hits for monomerid = 9437
TargetAcetylcholinesterase(Rattus norvegicus (rat))
Hong Kong University Of Science And Technology
LigandPNGBDBM9437(CHEMBL1084530 | Heterodimeric Tacrine-Based Inhibi...)
Affinity DataIC50:  83.6nMpH: 7.4 T: 2°C. Assay description: The cholinesterase assays were performed using colorimetric method reported by Ellman. Enzyme activity was determined by measuring the absorbance at...
In DepthDetails ArticlePubMed
TargetAcetylcholinesterase(Homo sapiens (Human))
Sichuan University
Curated by ChEMBL
LigandPNGBDBM9437(CHEMBL1084530 | Heterodimeric Tacrine-Based Inhibi...)
Affinity DataIC50:  83nM. Assay description: Inhibition of AChE
In DepthDetails ArticlePubMed
TargetCarboxylic ester hydrolase(Rattus norvegicus (rat))
Hong Kong University Of Science And Technology
LigandPNGBDBM9437(CHEMBL1084530 | Heterodimeric Tacrine-Based Inhibi...)
Affinity DataIC50:  200nM. Assay description: The cholinesterase assays were performed using colorimetric method reported by Ellman. Enzyme activity was determined by measuring the absorbance at...
In DepthDetails ArticlePubMed