BDBM94700 1,3-bis(o-anisylideneamino)urea::1,3-bis[(2-methoxyphenyl)methylideneamino]urea::MLS002667206::SMR001556976::cid_241318
SMILES COc1ccccc1C=NNC(=O)NN=Cc1ccccc1OC
InChI Key InChIKey=OWGDIIVCTDFKEG-UHFFFAOYSA-N
Data  1 IC50  1 EC50
  Tab Delimited (TSV)   2D SDfile   Computed 3D by Vconf -m prep SDfile
Find this compound or compounds like it in BindingDB:
Activity Spreadsheet -- Enzyme Inhibition Constant Data from BindingDB
Found 2 hits for monomerid = 94700
TargetTumor necrosis factor receptor superfamily member 10B(Homo sapiens (Human))
Burnham Center For Chemical Genomics
Curated by PubChem BioAssay
LigandPNGBDBM94700(1,3-bis(o-anisylideneamino)urea | 1,3-bis[(2-metho...)
Affinity DataEC50:  9.40E+3nM
In DepthDetails PCBioAssay
TargetADP-ribosylation factor GTPase-activating protein 1(Rattus norvegicus)
The Scripps Research Institute Molecular Screening Center
Curated by PubChem BioAssay
LigandPNGBDBM94700(1,3-bis(o-anisylideneamino)urea | 1,3-bis[(2-metho...)
Affinity DataIC50:  2.56E+4nM
In DepthDetails PCBioAssay