BDBM9631 (S)-N-(1S,2R)-[3-[2-[[(1,1-Dimethylethyl)amino]carbonyl]phenyl]-2-hydroxy-1-(phenylmethyl)-propyl]-2-[(methylsulfonyl)amino]-3-[(p-methoxyphenyl)-thio]propanamide::D-Cysteine Analog 16j::N-tert-butyl-2-[(2R,3S)-2-hydroxy-3-[(2S)-2-methanesulfonamido-3-[(4-methoxyphenyl)sulfanyl]propanamido]-4-phenylbutyl]benzamide
SMILES COc1ccc(SC[C@@H](NS(C)(=O)=O)C(=O)N[C@@H](Cc2ccccc2)[C@H](O)Cc2ccccc2C(=O)NC(C)(C)C)cc1
InChI Key InChIKey=JZFOEBZUSWFYSE-ZGIBFIJWSA-N
Data  1 IC50
  Tab Delimited (TSV)   2D SDfile   Computed 3D by Vconf -m prep SDfile
Find this compound or compounds like it in BindingDB:
Activity Spreadsheet -- Enzyme Inhibition Constant Data from BindingDB
Found 1 hit for monomerid = 9631
TargetDimer of Gag-Pol polyprotein [489-587](Human immunodeficiency virus type 1)
Eli Lilly
LigandPNGBDBM9631((S)-N-(1S,2R)-[3-[2-[[(1,1-Dimethylethyl)amino]car...)
Affinity DataIC50:  16nM. Assay description: The assay involves the use of a HIV-1 protease peptide substrate which has been modified to contain a biotin moiety on one side and a fluorescent rep...
In DepthDetails ArticlePubMed