BDBM9633 (S)-N-(1S,2R)-[3-[2-[[1,1-Dimethylethyl)amino]carbonyl]phenyl]-2-hydroxy-1-(phenylmethyl)-propyl]-2-[(methylsulfonyl)amino]-3-(phenylsulfinyl)-propanamide::2-[(2R,3S)-3-[(2S)-3-(benzenesulfinyl)-2-methanesulfonamidopropanamido]-2-hydroxy-4-phenylbutyl]-N-tert-butylbenzamide::D-Cysteine Analog 17d
SMILES CC(C)(C)NC(=O)c1ccccc1C[C@@H](O)[C@H](Cc1ccccc1)NC(=O)[C@@H](CS(=O)c1ccccc1)NS(C)(=O)=O
InChI Key InChIKey=VMWKIDHYEPOBNA-WQNBCVSBSA-N
Data  1 IC50
  Tab Delimited (TSV)   2D SDfile   Computed 3D by Vconf -m prep SDfile
Find this compound or compounds like it in BindingDB:
Activity Spreadsheet -- Enzyme Inhibition Constant Data from BindingDB
Found 1 hit for monomerid = 9633
TargetDimer of Gag-Pol polyprotein [489-587](Human immunodeficiency virus type 1)
Eli Lilly
LigandPNGBDBM9633((S)-N-(1S,2R)-[3-[2-[[1,1-Dimethylethyl)amino]carb...)
Affinity DataIC50:  1.90nM. Assay description: The assay involves the use of a HIV-1 protease peptide substrate which has been modified to contain a biotin moiety on one side and a fluorescent rep...
In DepthDetails ArticlePubMed