BDBM9647 D-Cysteine Analog 18j::N-tert-butyl-2-[(2R,3S)-2-hydroxy-3-[(2S)-2-methanesulfonamido-3-[(4-methoxybenzene)sulfonyl]propanamido]-4-phenylbutyl]benzamide
SMILES COc1ccc(cc1)S(=O)(=O)C[C@@H](NS(C)(=O)=O)C(=O)N[C@@H](Cc1ccccc1)[C@H](O)Cc1ccccc1C(=O)NC(C)(C)C
InChI Key InChIKey=IKSBXYJLBFHCCJ-ZGIBFIJWSA-N
Data  1 IC50
  Tab Delimited (TSV)   2D SDfile   Computed 3D by Vconf -m prep SDfile
Find this compound or compounds like it in BindingDB:
Activity Spreadsheet -- Enzyme Inhibition Constant Data from BindingDB
Found 1 hit for monomerid = 9647
TargetDimer of Gag-Pol polyprotein [489-587](Human immunodeficiency virus type 1)
Eli Lilly
LigandPNGBDBM9647(D-Cysteine Analog 18j | N-tert-butyl-2-[(2R,3S)-2-...)
Affinity DataIC50:  2.40nM. Assay description: The assay involves the use of a HIV-1 protease peptide substrate which has been modified to contain a biotin moiety on one side and a fluorescent rep...
In DepthDetails ArticlePubMed