BDBM96470 5-Methyl-3-phenyl-isoxazole-4-carboxylic acid {N'-[5-(4-fluoro-phenyl)-1H-pyrazole-3-carbonyl]-hydrazinocarbothioyl}-amide::MLS000769391::N-[[[3-(4-fluorophenyl)-1H-pyrazol-5-yl]carbonylamino]carbamothioyl]-5-methyl-3-phenyl-1,2-oxazole-4-carboxamide::N-[[[3-(4-fluorophenyl)-1H-pyrazole-5-carbonyl]amino]carbamothioyl]-5-methyl-3-phenyl-1,2-oxazole-4-carboxamide::N-[[[3-(4-fluorophenyl)-1H-pyrazole-5-carbonyl]amino]thiocarbamoyl]-5-methyl-3-phenyl-isoxazole-4-carboxamide::N-[[[[3-(4-fluorophenyl)-1H-pyrazol-5-yl]-oxomethyl]hydrazo]-sulfanylidenemethyl]-5-methyl-3-phenyl-4-isoxazolecarboxamide::SMR000434125::cid_1883114
SMILES Cc1onc(c1C(=O)NC(=S)NNC(=O)c1cc(n[nH]1)-c1ccc(F)cc1)-c1ccccc1
InChI Key InChIKey=CTQXGOYHIYVHLZ-UHFFFAOYSA-N
Data  1 IC50
  Tab Delimited (TSV)   2D SDfile   Computed 3D by Vconf -m prep SDfile
Find this compound or compounds like it in BindingDB:
Activity Spreadsheet -- Enzyme Inhibition Constant Data from BindingDB
Found 1 hit for monomerid = 96470
TargetHuntingtin(Homo sapiens (Human))
The Scripps Research Institute Molecular Screening Center
Curated by PubChem BioAssay
LigandPNGBDBM96470(5-Methyl-3-phenyl-isoxazole-4-carboxylic acid {N&#...)
Affinity DataIC50:  1.85E+3nM
In DepthDetails PCBioAssay