BDBM96610 5-[(2-fluorobenzyl)sulfonylmethyl]-N-phenethyl-2-furamide::5-[(2-fluorophenyl)methylsulfonylmethyl]-N-(2-phenylethyl)-2-furancarboxamide::5-[(2-fluorophenyl)methylsulfonylmethyl]-N-(2-phenylethyl)furan-2-carboxamide::MLS000521189::SMR000131598::cid_3582921
SMILES Fc1ccccc1CS(=O)(=O)Cc1ccc(o1)C(=O)NCCc1ccccc1
InChI Key InChIKey=CHYXIBROVMUMRJ-UHFFFAOYSA-N
Data  2 IC50  2 EC50
  Tab Delimited (TSV)   2D SDfile   Computed 3D by Vconf -m prep SDfile
Find this compound or compounds like it in BindingDB:
Activity Spreadsheet -- Enzyme Inhibition Constant Data from BindingDB
Found 4 hits for monomerid = 96610
TargetGuanine nucleotide-binding protein subunit alpha-15(Homo sapiens (Human))
The Scripps Research Institute Molecular Screening Center
Curated by PubChem BioAssay
LigandPNGBDBM96610(5-[(2-fluorobenzyl)sulfonylmethyl]-N-phenethyl-2-f...)
Affinity DataEC50: >2.99E+4nM
In DepthDetails PCBioAssay
TargetGuanine nucleotide-binding protein subunit alpha-15(Homo sapiens (Human))
The Scripps Research Institute Molecular Screening Center
Curated by PubChem BioAssay
LigandPNGBDBM96610(5-[(2-fluorobenzyl)sulfonylmethyl]-N-phenethyl-2-f...)
Affinity DataIC50:  1.77E+4nM
In DepthDetails PCBioAssay
TargetTrace amine-associated receptor 1(Homo sapiens (Human))
The Scripps Research Institute Molecular Screening Center
Curated by PubChem BioAssay
LigandPNGBDBM96610(5-[(2-fluorobenzyl)sulfonylmethyl]-N-phenethyl-2-f...)
Affinity DataEC50:  2.78E+3nM
In DepthDetails PCBioAssay
TargetTrace amine-associated receptor 1(Homo sapiens (Human))
The Scripps Research Institute Molecular Screening Center
Curated by PubChem BioAssay
LigandPNGBDBM96610(5-[(2-fluorobenzyl)sulfonylmethyl]-N-phenethyl-2-f...)
Affinity DataIC50:  5.69E+3nM
In DepthDetails PCBioAssay