BDBM97659 US8470837, 42
SMILES Cn1c2ncn(Cc3ccccc3)c(=O)c2c(Nc2ccc(I)cc2F)cc1=O
InChI Key InChIKey=RNIPEWHRLMDRAX-UHFFFAOYSA-N
Data  1 IC50
  Tab Delimited (TSV)   2D SDfile   Computed 3D by Vconf -m prep SDfile
Find this compound or compounds like it in BindingDB:
Activity Spreadsheet -- Enzyme Inhibition Constant Data from BindingDB
Found 1 hit for monomerid = 97659
TargetDual specificity mitogen-activated protein kinase kinase 1 [2-31,52-393,S218E,S222D](Homo sapiens (Human))
Takeda Pharmaceutical
US Patent
LigandPNGBDBM97659(US8470837, 42)
Affinity DataIC50: >16nMpH: 7.3 T: 2°C. Assay description: Reaction product is determined quantitatively by fluorescent polarization using progressive IMAP beads from Molecular Devices.
In DepthDetails US Patent