BDBM97674 US8476284, 42::US8497277, 8::US9133201, 8
SMILES Nc1ncnc2n(nc(-c3ccc(Oc4ccccc4)cc3)c12)C1CCCN(C1)C(=O)C#C
InChI Key InChIKey=NAQYQSPFDLXJIK-UHFFFAOYSA-N
Data  4 IC50
  Tab Delimited (TSV)   2D SDfile   Computed 3D by Vconf -m prep SDfile
Find this compound or compounds like it in BindingDB:
Activity Spreadsheet -- Enzyme Inhibition Constant Data from BindingDB
Found 4 hits for monomerid = 97674
TargetTyrosine-protein kinase BTK(Homo sapiens (Human))
Pharmacyclics
US Patent
LigandPNGBDBM97674(US8476284, 42 | US8497277, 8 | US9133201, 8)
Affinity DataIC50:  0.720nMpH: 7.4Assay Description:Btk kinase activity was determined using a time-resolved fluorescence resonance energy transfer (TR-FRET) methodology.
In DepthDetails US Patent
TargetTyrosine-protein kinase BTK(Homo sapiens (Human))
Pharmacyclics
US Patent
LigandPNGBDBM97674(US8476284, 42 | US8497277, 8 | US9133201, 8)
Affinity DataIC50:  0.720nM. Assay description: Inhibition of BTK (unknown origin)
In DepthDetails ArticlePubMed
TargetTyrosine-protein kinase BTK(Homo sapiens (Human))
Pharmacyclics
US Patent
LigandPNGBDBM97674(US8476284, 42 | US8497277, 8 | US9133201, 8)
Affinity DataIC50:  0.720nMpH: 7.4Assay Description:Btk kinase activity was determined using a time-resolved fluorescence resonance energy transfer (TR-FRET) methodology. Measurements were performed in...
In DepthDetails US Patent
TargetTyrosine-protein kinase BTK(Homo sapiens (Human))
Pharmacyclics
US Patent
LigandPNGBDBM97674(US8476284, 42 | US8497277, 8 | US9133201, 8)
Affinity DataIC50:  0.720nMpH: 7.4Assay Description:Btk kinase activity was determined using a time-resolved fluorescence resonance energy transfer (TR-FRET) methodology.
In DepthDetails US Patent