BDBM98648 US8497376, 27
SMILES CC1(C)CCC(=CC1)c1cc(ccc1NC(=O)c1ncc([nH]1)C#N)[C@@]1(O)CC2O[C@@H](C1)C=C2
InChI Key InChIKey=KXPTVZLFHYVEEA-OETVIPGSSA-N
Data  1 IC50
  Tab Delimited (TSV)   2D SDfile   Computed 3D by Vconf -m prep SDfile
Find this compound or compounds like it in BindingDB:
Activity Spreadsheet -- Enzyme Inhibition Constant Data from BindingDB
Found 1 hit for monomerid = 98648
TargetMacrophage colony-stimulating factor 1 receptor(Mus musculus (Mouse))
Janssen Pharmaceutica
US Patent
LigandPNGBDBM98648(US8497376, 27)
Affinity DataIC50:  0.660nMpH: 7.5Assay Description:An autophosphorylation, fluroescence polarization competition immunoassay was used to determine the potency for c-fms inhibition.
In DepthDetails US Patent