BDBM9903 3-Phenyl-7-(beta-naphthylmethoxy)-2-[(4-pyridylmethyl)thio]-4H-1-benzopyran-4-one::7-(naphthalen-2-ylmethoxy)-3-phenyl-2-[(pyridin-4-ylmethyl)sulfanyl]-4H-chromen-4-one::isoflavone deriv. 5e
SMILES O=c1c(-c2ccccc2)c(SCc2ccncc2)oc2cc(OCc3ccc4ccccc4c3)ccc12
InChI Key InChIKey=IVKLCSXSBGHSJA-UHFFFAOYSA-N
Data  1 KI  1 IC50
  Tab Delimited (TSV)   2D SDfile   Computed 3D by Vconf -m prep SDfile
Find this compound or compounds like it in BindingDB:
Activity Spreadsheet -- Enzyme Inhibition Constant Data from BindingDB
Found 1 hit for monomerid = 9903
TargetAromatase(Homo sapiens (Human))
Ohio State University
LigandPNGBDBM9903(3-Phenyl-7-(beta-naphthylmethoxy)-2-[(4-pyridylmet...)
Affinity DataKi:  74nM ΔG°:  -10.1kcal/mole IC50:  90nMpH: 7.0 T: 2°C. Assay description: Inhibition of human placental aromatase was determined by monitoring the amount of 3H2O released as the enzyme converts [1beta-3H]androst-4-ene-3,17-...
In DepthDetails ArticlePubMed