BDBM9940 (8S)-2,8,15-trimethyltetracyclo[8.7.0.0^{2,7}.0^{11,15}]heptadeca-3,6-diene-5,14-dione::6-Alkyl 1,4-Diene Steroid 3a
SMILES C[C@H]1CC2C3CCC(=O)C3(C)CCC2C2(C)C=CC(=O)C=C12
InChI Key InChIKey=BWNQBQAKVQVBHH-LQVSISNVSA-N
Data  1 KI  1 IC50
  Tab Delimited (TSV)   2D SDfile   Computed 3D by Vconf -m prep SDfile
Find this compound or compounds like it in BindingDB:
Activity Spreadsheet -- Enzyme Inhibition Constant Data from BindingDB
Found 1 hit for monomerid = 9940
TargetAromatase(Homo sapiens (Human))
Tohoku College Of Pharmacy
LigandPNGBDBM9940((8S)-2,8,15-trimethyltetracyclo[8.7.0.0^{2,7}.0^{1...)
Affinity DataKi:  54nM ΔG°:  -10.3kcal/mole IC50:  620nMpH: 7.5 T: 2°C. Assay description: The enzyme activity was assayed by measuring the 3H-labeled H2O formed from [1beta-3H] Androstenedione during aromatization. After incubation, the re...
In DepthDetails ArticlePubMed