BDBM99937 US8501729, 33
SMILES O=C1N(CCc2c[nH]c3cccc1c23)[C@H]1CN2CCC1CC2
InChI Key InChIKey=WHVZPNITVJSAMC-INIZCTEOSA-N
Data  1 KI
  Tab Delimited (TSV)   2D SDfile   Computed 3D by Vconf -m prep SDfile
Find this compound or compounds like it in BindingDB:
Activity Spreadsheet -- Enzyme Inhibition Constant Data from BindingDB
Found 1 hit for monomerid = 99937
Target5-hydroxytryptamine receptor 3A(Homo sapiens (Human))
Albany Molecular Research
US Patent
LigandPNGBDBM99937(US8501729, 33)
Affinity DataKi:  49nMpH: 7.5Assay Description:The relative affinity of the various compounds for the human 5-HT3 receptor was measured in a radioligand binding assay, using a scintillation proxim...
In DepthDetails US Patent