Cell Reactant:
Farnesyl Diphosphate Synthase (FPPS)
Syringe Reactant:
BDBM12576
Meas. Tech.:
Isothermal Titration Calorimetry
Entry Date.:
12/13/06
ΔG°:
-40.5878±n/a (kJ/mole)
pH:
7.4±n/a
Temperature:
300±n/a (K)
ΔHobs :
-37.0766±n/a (kJ/mole)
Corrected for ΔHioniz:
no
ΔS° :
0.0118±n/a (kJ/mole-K)
Comments:
IC50=0.5 uM
Citation
 Yin, FCao, RGoddard, AZhang, YOldfield, E Enthalpy versus entropy-driven binding of bisphosphonates to farnesyl diphosphate synthase. J Am Chem Soc 128:3524-5 (2006) 
Cell React
Name:
Farnesyl Diphosphate Synthase (FPPS)
Synonyms:
Type:
Enzyme
Mol. Mass.:
41958.09
Organism:
Trypanosoma brucei
Description:
Q86C09
Residue:
367
  
Syringe React
Name:
BDBM12576
Synonyms:
Bisphosphonate 1 JMC515594 Compound 64 Risdronate [1-hydroxy-1-phosphono-2-(pyridin-3-yl)ethyl]phosphonic acid
Type:
Small organic molecule
Emp. Form.:
C7H11NO7P2
Mol. Mass.:
283.1123
SMILES:
OC(Cc1cccnc1)(P(O)(O)=O)P(O)(O)=O
: