Cell Reactant:
Farnesyl Diphosphate Synthase (FPPS)
Syringe Reactant:
BDBM12580
Meas. Tech.:
Isothermal Titration Calorimetry
Entry Date.:
12/13/06
ΔG°:
-38.4978±n/a (kJ/mole)
pH:
7.4±n/a
Temperature:
300±n/a (K)
ΔHobs :
30.1378±n/a (kJ/mole)
Corrected for ΔHioniz:
no
ΔS° :
0.2302±n/a (kJ/mole-K)
Comments:
IC50=1.3 uM
Citation
 Yin, FCao, RGoddard, AZhang, YOldfield, E Enthalpy versus entropy-driven binding of bisphosphonates to farnesyl diphosphate synthase. J Am Chem Soc 128:3524-5 (2006) 
Cell React
Name:
Farnesyl Diphosphate Synthase (FPPS)
Synonyms:
Type:
Enzyme
Mol. Mass.:
41958.09
Organism:
Trypanosoma brucei
Description:
Q86C09
Residue:
367
  
Syringe React
Name:
BDBM12580
Synonyms:
1-(2-hydrogen phosphonato-2-hydroxy-2-phosphonoethyl)-3-iodopyridin-1-ium | Bisphosphonate 5
Type:
Small organic molecule
Emp. Form.:
C7H10INO7P2
Mol. Mass.:
409.0088
SMILES:
OC(C[n+]1cccc(I)c1)(P(O)(O)=O)P(O)([O-])=O
: