Target
Phosphatidylinositol 4,5-bisphosphate 3-kinase catalytic subunit gamma isoform
Ligand
BDBM506888
Substrate
Meas. Tech.
PI3K-gamma Scintillation Proximity Assay
IC50
<100±n/a nM
Citation
 Douty, BAi, YBurns, DMCombs, APFalahatpisheh, NLevy, DPolam, PShao, LShepard, SShvartsbart, AYue, EWBuesking, AW Aminopyrazine derivatives as PI3K-γ inhibitors US Patent  US11046658 Publication Date 6/29/2021 
Target
Name:
Phosphatidylinositol 4,5-bisphosphate 3-kinase catalytic subunit gamma isoform
Synonyms:
PI3-kinase p110 subunit gamma PI3Kgamma PK3CG_HUMAN Phosphatidylinositol 4,5-bisphosphate 3-kinase (PI3K) Phosphatidylinositol 4,5-bisphosphate 3-kinase catalytic subunit gamma (PI3Kgamma) Phosphatidylinositol 4,5-bisphosphate 3-kinase catalytic subunit gamma isoform (PI3K) Phosphatidylinositol-4,5-bisphosphate 3-kinase catalytic subunit gamma isoform Phosphoinositide 3-kinases gamma (PI3K gamma) p120-PI3K
Type:
Enzyme Subunit
Mol. Mass.:
126470.30
Organism:
Homo sapiens (Human)
Description:
P48736
Residue:
1102
  
Inhibitor
Name:
BDBM506888
Synonyms:
3-amino-6-(5-(3-amino-1,1,1-trifluoro-2-hydroxy-3-oxopropan-2-yl)-2-methylphenyl)-N-(3,3,3-trifluoro-2-hydroxypropyl)pyrazine-2-carboxamide US11046658, Example 43B++
Type:
Small organic molecule
Emp. Form.:
C18H17F6N5O4
Mol. Mass.:
481.3491
SMILES:
Cc1ccc(cc1-c1cnc(N)c(n1)C(=O)NCC(O)C(F)(F)F)C(O)(C(N)=O)C(F)(F)F
: