Target
Sigma intracellular receptor 2
Ligand
BDBM507026
Substrate
Ki
318±n/a nM
Citation
 Martin, SFSahn, JJHodges, TR Piperazinyl norbenzomorphan compounds and methods for using the same US Patent  US11046670 Publication Date 6/29/2021 
Target
Name:
Sigma intracellular receptor 2
Synonyms:
MAC30 S2R Sigma-2 receptor TMEM97 | Transmembrane protein 97
Type:
Protein
Mol. Mass.:
20857.20
Organism:
Homo sapiens (Human)
Description:
Q5BJF2
Residue:
176
  
Inhibitor
Name:
BDBM507026
Synonyms:
US11046670, Compound 19
Type:
Small organic molecule
Emp. Form.:
C23H28N2
Mol. Mass.:
332.4818
SMILES:
C(N1CC[C@@H]2C[C@@H]1c1cc(ccc21)N1CCCCC1)c1ccccc1
: