Target
Sigma intracellular receptor 2
Ligand
BDBM507032
Substrate
Ki
6.08±0.08 nM
Citation
 Martin, SFSahn, JJHodges, TR Piperazinyl norbenzomorphan compounds and methods for using the same US Patent  US11046670 Publication Date 6/29/2021 
Target
Name:
Sigma intracellular receptor 2
Synonyms:
MAC30 S2R Sigma-2 receptor TMEM97 | Transmembrane protein 97
Type:
Protein
Mol. Mass.:
20857.20
Organism:
Homo sapiens (Human)
Description:
Q5BJF2
Residue:
176
  
Inhibitor
Name:
BDBM507032
Synonyms:
US11046670, Compound 44
Type:
Small organic molecule
Emp. Form.:
C26H25NO2
Mol. Mass.:
383.4822
SMILES:
Cc1cccc(c1)-c1ccc2[C@H]3C[C@@H](N(Cc4ccc5OCOc5c4)CC3)c2c1
: