Target
Sigma intracellular receptor 2
Ligand
BDBM50232749
Substrate
Ki
17.5±n/a nM
Citation
 Martin, SFSahn, JJHodges, TR Piperazinyl norbenzomorphan compounds and methods for using the same US Patent  US11046670 Publication Date 6/29/2021 
Target
Name:
Sigma intracellular receptor 2
Synonyms:
MAC30 S2R Sigma-2 receptor TMEM97 | Transmembrane protein 97
Type:
Protein
Mol. Mass.:
20857.20
Organism:
Homo sapiens (Human)
Description:
Q5BJF2
Residue:
176
  
Inhibitor
Name:
BDBM50232749
Synonyms:
CHEMBL4095749 | US11046670, Table 6.5
Type:
Small organic molecule
Emp. Form.:
C27H33N3O2
Mol. Mass.:
431.5698
SMILES:
[H][C@]12C[C@@]([H])(N(CC1)C(=O)OCc1ccccc1)c1cc(ccc21)N1CCN(CC(C)=C)CC1
: