Target
Toll-like receptor 7
Ligand
BDBM507042
Substrate
Meas. Tech.
Pharmacological Test
EC50
>100000±n/a nM
Citation
 Dey, FWang, LYun, HZhang, WZhang, ZZhu, W Dihydropyrimidinyl benzazepine carboxamide compounds US Patent  US11046671 Publication Date 6/29/2021 
Target
Name:
Toll-like receptor 7
Synonyms:
ORF Names:UNQ248/PRO285 TLR7_HUMAN | Toll-like receptor 7 (TLR7)
Type:
Enzyme
Mol. Mass.:
120945.35
Organism:
Homo sapiens (Human)
Description:
Q9NYK1
Residue:
1049
  
Inhibitor
Name:
BDBM507042
Synonyms:
2-Amino-N-(cyclopropylmethyl)-8-(1,4-dihydroquinazolin-2-yl)-N-propyl-3H-1-benzazepine-4-carboxamide | US11046671, Example 3
Type:
Small organic molecule
Emp. Form.:
C26H29N5O
Mol. Mass.:
427.5414
SMILES:
CCCN(CC1CC1)C(=O)C1=Cc2ccc(cc2N=C(N)C1)C1=NCc2ccccc2N1
: