Target
Platelet-derived growth factor receptor beta
Ligand
BDBM507080
Substrate
Meas. Tech.
PDGFRbeta Enzyme Inhibition
Ki
7.48±n/a nM
Citation
 Walters, IBirch, LHill-Cousins, JCollingwood, SPStevenson, CS Indolinones compounds and their use in the treatment of fibrotic diseases US Patent  US11046672 Publication Date 6/29/2021 
Target
Name:
Platelet-derived growth factor receptor beta
Synonyms:
Beta-type platelet-derived growth factor receptor CD140b antigen PDGF Receptor Substrate PDGFR PDGFR-1 PDGFRB PGFRB_HUMAN Platelet-derived growth factor receptor 1 Platelet-derived growth factor receptor beta (PDGFR-beta) Platelet-derived growth factor receptor beta (PDGFRbeta) | VHL/PDGFRB
Type:
Enzyme
Mol. Mass.:
123922.25
Organism:
Homo sapiens (Human)
Description:
P09619
Residue:
1106
  
Inhibitor
Name:
BDBM507080
Synonyms:
US11046672, Example 29
Type:
Small organic molecule
Emp. Form.:
C31H34N4O5
Mol. Mass.:
542.6255
SMILES:
COC(=O)c1cc2NC(=O)\C(=C(/Nc3ccc(C(=O)NOCCCN(C)C)c(C)c3)c3ccccc3)c2cc1C
: