Target
Apelin receptor
Ligand
BDBM507219
Substrate
Meas. Tech.
[35S]GTPgammaS Binding
EC50
5.30±n/a nM
Citation
 Chen, NChen, XChen, YCheng, ACConnors, RVDeignan, JDransfield, PJDu, XFu, ZHarvey, JSHeath, JAHeumann, LVHorne, DBHouze, JKaller, MRKayser, FKhakoo, AYKopecky, DJLai, SMa, ZMedina, JCMihalic, JTNishimura, NOlson, SHPattaropong, VSwaminath, GWang, XWanska, MYang, KYeh, W Heteroaryl-substituted triazoles as APJ receptor agonists US Patent  US11046680 Publication Date 6/29/2021 
Target
Name:
Apelin receptor
Synonyms:
AGTRL1 APJ_HUMAN Angiotensin receptor-like 1 Apelin receptor (APJ) G-protein coupled receptor HG11
Type:
Enzyme Catalytic Domain
Mol. Mass.:
42664.06
Organism:
Homo sapiens (Human)
Description:
P35414
Residue:
380
  
Inhibitor
Name:
BDBM507219
Synonyms:
US11046680, Example 98.0
Type:
Small organic molecule
Emp. Form.:
C18H23NO4
Mol. Mass.:
317.3795
SMILES:
COc1ccc(CNCc2ccc(OC)cc2OC)c(OC)c1
: