Target
Ubiquitin carboxyl-terminal hydrolase 7
Ligand
BDBM507625
Substrate
Meas. Tech.
Evaluation of the Inhibition of USP7 by the Fluorescence Intensity (FLINT) Readings
IC50
37.7±n/a nM
Citation
 Kotschy, AWéber, CVasas, AMolnár, BKiss, nullMacias, AMurray, JBLewkowicz, EGeneste, OChanrion, MDemarles, D Substituted piperidines for the treatment of cancer US Patent  US11046681 Publication Date 6/29/2021 
Target
Name:
Ubiquitin carboxyl-terminal hydrolase 7
Synonyms:
Deubiquitinating enzyme 7 Herpesvirus-associated ubiquitin-specific protease USP7 Ubiquitin-specific-processing protease 7
Type:
PROTEIN
Mol. Mass.:
128274.45
Organism:
Homo sapiens (Human)
Description:
ChEMBL_1469483
Residue:
1102
  
Inhibitor
Name:
BDBM507625
Synonyms:
7-(4-fluorophenyl)-3-[[4-hydroxy-1-[(3R,4R)-3-phenylpiperidine-4-carbonyl]-4-piperidyl]methyl]pyrrolo[2,3-d]pyrimidin-4-one | US11046681, Example 130
Type:
Small organic molecule
Emp. Form.:
C30H32FN5O3
Mol. Mass.:
529.6052
SMILES:
OC1(Cn2cnc3n(ccc3c2=O)-c2ccc(F)cc2)CCN(CC1)C(=O)[C@@H]1CCNC[C@H]1c1ccccc1
: