Target
Indoleamine 2,3-dioxygenase 1
Ligand
BDBM507648
Substrate
Meas. Tech.
IDO Enzyme Activity Inhibition Testing
IC50
875±n/a nM
Citation
 Chen, XGao, Y Fused heterocyclic derivatives, their preparation methods thereof and medical uses thereof US Patent  US11046682 Publication Date 6/29/2021 
Target
Name:
Indoleamine 2,3-dioxygenase 1
Synonyms:
I23O1_HUMAN IDO-1 INDO Indoleamine 2,3-dioxygenase | Indoleamine-pyrrole 2,3-dioxygenase
Type:
Enzyme
Mol. Mass.:
45330.80
Organism:
Homo sapiens (Human)
Description:
P14902
Residue:
403
  
Inhibitor
Name:
BDBM507648
Synonyms:
US11046682, Compound 3
Type:
Small organic molecule
Emp. Form.:
C14H11ClN4O
Mol. Mass.:
286.716
SMILES:
Clc1ccc(NC(=O)Nc2cccc3cncn23)cc1
: