Target
Nuclear receptor ROR-gamma
Ligand
BDBM302192
Substrate
Meas. Tech.
Reporter Gene Assay
IC50
3000±n/a nM
Citation
 Bakonyi, JBrunette, SRCollin, DHughes, ROLi, XLiang, SSibley, RTurner, MRWu, LZhang, Q Compounds as modulators of RORγ US Patent  US9598415 Publication Date 3/21/2017 
Target
Name:
Nuclear receptor ROR-gamma
Synonyms:
NR1F3 Nuclear receptor ROR-gamma (RORC) RAR-related orphan receptor C (RORc) RORG RZRG Retinoid-related orphan receptor-gamma (RORc)
Type:
Enzyme Catalytic Domain
Mol. Mass.:
58218.40
Organism:
Homo sapiens (Human)
Description:
P51449
Residue:
518
  
Inhibitor
Name:
BDBM302192
Synonyms:
US9598415, 104
Type:
Small organic molecule
Emp. Form.:
C24H26N8O3S
Mol. Mass.:
506.58
SMILES:
CCn1c2nc(ncc2nc(NCc2ccc(cn2)S(=O)(=O)CC)c1=O)-c1c(C)ncnc1C1CC1
: