Target
Dual specificity protein kinase TTK
Ligand
BDBM241302
Substrate
Meas. Tech.
Measurement of Inhibition of MPS1 Kinase
IC50
4.00±n/a nM
Citation
 Hoelder, SBlagg, JSolanki, SWoodward, HNaud, SGBavetsias, VSheldrake, PInnocenti, PCheung, KJAtrash, B Inhibitor compounds US Patent  US11046688 Publication Date 6/29/2021
Target
Name:
Dual specificity protein kinase TTK
Synonyms:
Dual specificity protein kinase (TTK) MPS1 Monopolar Spindle 1 (MPS1) Monopolar Spindle 1 Kinase (MPS1) TTK | TTK_HUMAN
Type:
Protein
Mol. Mass.:
97086.79
Organism:
Homo sapiens (Human)
Description:
P33981
Residue:
857
  
Inhibitor
Name:
BDBM241302
Synonyms:
US10479788, Example 146 US9409907, 146
Type:
Small organic molecule
Emp. Form.:
C24H27N7O2
Mol. Mass.:
445.5169
SMILES:
COc1cc(ccc1Nc1ncc2ccnc(NCC3(C)COC3)c2n1)-c1cnn(C)c1C
: