Target
Estrogen receptor
Ligand
BDBM361452
Substrate
Meas. Tech.
ERalpha Binding Assay
IC50
1.000±n/a nM
Citation
 Nissink, JWScott, JSMoss, TAHughes, SJBarlaam, BCYang, B Selective estrogen receptor down-regulators US Patent  US11046689 Publication Date 6/29/2021 
Target
Name:
Estrogen receptor
Synonyms:
ER ESR ESR1_HUMAN Estrogen receptor Estrogen receptor (ER-alpha) Estrogen receptor alpha (ER) Nuclear receptor subfamily 3 group A member 1
Type:
Protein
Mol. Mass.:
66230.44
Organism:
Homo sapiens (Human)
Description:
P03372
Residue:
595
  
Inhibitor
Name:
BDBM361452
Synonyms:
3-((1R,3R)-1- (2-chloro-5-(2- ((3- fluoropropyl) amino)ethoxy) phenyl)-3- methyl- 1,3,4,9- tetrahydro-2H- pyrido[3,4- b]indol-2-yl)- 2,2- difluoropropan- 1-ol US10590132, Example 44 | US11046689, Example 44
Type:
Small organic molecule
Emp. Form.:
C26H31ClF3N3O2
Mol. Mass.:
509.991
SMILES:
C[C@@H]1Cc2c([nH]c3ccccc23)[C@H](N1CC(F)(F)CO)c1cc(OCCNCCCF)ccc1Cl
: