Target
Estrogen receptor
Ligand
BDBM361562
Substrate
Meas. Tech.
ERalpha Binding Assay
IC50
1.20±n/a nM
Citation
 Nissink, JWScott, JSMoss, TAHughes, SJBarlaam, BCYang, B Selective estrogen receptor down-regulators US Patent  US11046689 Publication Date 6/29/2021 
Target
Name:
Estrogen receptor
Synonyms:
ER ESR ESR1_HUMAN Estrogen receptor Estrogen receptor (ER-alpha) Estrogen receptor alpha (ER) Nuclear receptor subfamily 3 group A member 1
Type:
Protein
Mol. Mass.:
66230.44
Organism:
Homo sapiens (Human)
Description:
P03372
Residue:
595
  
Inhibitor
Name:
BDBM361562
Synonyms:
N-(2-(2,4- difluoro-3- ((1R,3R)-2-((3- fluorooxetan- 3-yl)methyl)- 3-methyl- 2,3,4,9- tetrahydro-1H- pyrido[3,4- b]indol-1- yl)phenoxy) ethyl)-3-fluoro-N- methylpropan- 1-amine US10590132, Example 154 | US11046689, Example 154
Type:
Small organic molecule
Emp. Form.:
C28H33F4N3O2
Mol. Mass.:
519.5741
SMILES:
C[C@@H]1Cc2c([nH]c3ccccc23)[C@H](N1CC1(F)COC1)c1c(F)ccc(OCCN(C)CCCF)c1F
: