Target
Metabotropic glutamate receptor 5
Ligand
BDBM292303
Substrate
Meas. Tech.
Calcium Influx Assay Based on Fluorescence
EC50
300±n/a nM
Citation
 Park, CEJang, YKShin, YJKim, JYHam, SMKim, YGMin, HKCha, SBJung, HJLee, JYHan, SNChung, JYChoi, EJJoung, CMPark, JSLee, JWCho, NRRyu, EJMaeng, CY Imidazopyrimidine and imidazotriazine derivative, and pharmaceutical composition comprising the same US Patent  US11046702 Publication Date 6/29/2021 
Target
Name:
Metabotropic glutamate receptor 5
Synonyms:
GPRC1E GRM5_HUMAN metabotropic glutamate 5 | metabotropic glutamate 5a
Type:
Enzyme
Mol. Mass.:
132484.72
Organism:
Homo sapiens (Human)
Description:
Residue:
1212
  
Inhibitor
Name:
BDBM292303
Synonyms:
US10100057, Example 158 US9745310, Example 158
Type:
Small organic molecule
Emp. Form.:
C19H14F2N4O
Mol. Mass.:
352.3375
SMILES:
Cc1cc(F)ccc1-c1cnc2nc(COc3ccc(F)nc3)cn2c1
: